BDBM50525525 CHEMBL4562469
SMILES Clc1ccc(CO\N=C\c2c(nc3sccn23)-c2ccc(Br)cc2)cc1Cl
InChI Key InChIKey=AERQHGOFHYGQHP-AUEPDCJTSA-N
Data  1 EC50
  Tab Delimited (TSV)   2D SDfile   Computed 3D by Vconf -m prep SDfile
Find this compound or compounds like it in BindingDB:
Activity Spreadsheet -- Enzyme Inhibition Constant Data from BindingDB
Found 1 hit for monomerid = 50525525
TargetNuclear receptor subfamily 1 group I member 3(Homo sapiens (Human))
University Of Maryland
Curated by ChEMBL
LigandPNGBDBM50525525(CHEMBL4562469)
Affinity DataEC50:  480nM. Assay description: Agonist activity at human CAR transfected in human HepG2 cells cotransfected with CYP2B6 incubated for 23 hrs by luciferase reported gene assay
Ligand InfoPC cidPC sid
In DepthDetails ArticlePubMed