BDBM50525537 CHEMBL4466018
SMILES Clc1cccc(c1)-c1nc2sccn2c1\C=N\OCc1ccc(Cl)c(Cl)c1
InChI Key InChIKey=JRMGKFBMKAIVMN-AUEPDCJTSA-N
Data  1 EC50
  Tab Delimited (TSV)   2D SDfile   Computed 3D by Vconf -m prep SDfile
Find this compound or compounds like it in BindingDB:
Activity Spreadsheet -- Enzyme Inhibition Constant Data from BindingDB
Found 1 hit for monomerid = 50525537
TargetNuclear receptor subfamily 1 group I member 3(Homo sapiens (Human))
University Of Maryland
Curated by ChEMBL
LigandPNGBDBM50525537(CHEMBL4466018)
Affinity DataEC50:  1.10E+3nM. Assay description: Agonist activity at human CAR transfected in human HepG2 cells cotransfected with CYP2B6 incubated for 23 hrs by luciferase reported gene assay
Ligand InfoPC cidPC sid
In DepthDetails ArticlePubMed