BDBM50525545 CHEMBL4450328
SMILES Clc1ccccc1CO\N=C\c1c(nc2occn12)-c1ccc2ccccc2c1
InChI Key InChIKey=YMGMDVWDFAETAA-AFUMVMLFSA-N
Data  1 EC50
  Tab Delimited (TSV)   2D SDfile   Computed 3D by Vconf -m prep SDfile
Find this compound or compounds like it in BindingDB:
Activity Spreadsheet -- Enzyme Inhibition Constant Data from BindingDB
Found 1 hit for monomerid = 50525545
TargetNuclear receptor subfamily 1 group I member 3(Homo sapiens (Human))
University Of Maryland
Curated by ChEMBL
LigandPNGBDBM50525545(CHEMBL4450328)
Affinity DataEC50:  1.10E+3nM. Assay description: Agonist activity at human CAR transfected in human HepG2 cells cotransfected with CYP2B6 incubated for 23 hrs by luciferase reported gene assay
Ligand InfoPC cidPC sid
In DepthDetails ArticlePubMed