BDBM50525901 CHEMBL4448315
SMILES Cl.NC(=N)c1ccc(CC2OB(O)c3ccc(F)cc23)cc1OCc1cccnc1
InChI Key InChIKey=MDPKHZAASWAWDT-UHFFFAOYSA-N
Data  12 IC50
  Tab Delimited (TSV)   2D SDfile   Computed 3D by Vconf -m prep SDfile
Find this compound or compounds like it in BindingDB:
Activity Spreadsheet -- Enzyme Inhibition Constant Data from BindingDB
Found 12 hits for monomerid = 50525901
TargetKallikrein-8(Homo sapiens (Human))
Glaxosmithkline
Curated by ChEMBL
LigandPNGBDBM50525901(CHEMBL4448315)
Affinity DataIC50:  1.26E+4nM. Assay description: Inhibition of recombinant human C-terminal 10-His-tagged KLK8 (Gln29 to Gly260 residues) expressed in mouse NS0 cells using BOC-VPR-AMC as substrate ...
Ligand InfoPC cidPC sid
In DepthDetails ArticlePubMed
TargetKallikrein-5(Homo sapiens (Human))
Glaxosmithkline
Curated by ChEMBL
LigandPNGBDBM50525901(CHEMBL4448315)
Affinity DataIC50:  16nM. Assay description: Inhibition of human recombinant 6His-Q-FLAG-tagged KLK5 expressed in baculovirus infected Sf9 insect cells using (Tos-Gly-Pro-Arg)2[R110].2TFA as sub...
Ligand InfoPC cidPC sid
In DepthDetails ArticlePubMed
TargetKallikrein-1(Homo sapiens (Human))
Glaxosmithkline
Curated by ChEMBL
LigandPNGBDBM50525901(CHEMBL4448315)
Affinity DataIC50: <1.00E+4nM. Assay description: Inhibition of human recombinant N-terminal His-tagged and enterokinase cleavage site-fused KLK1 (19 to 262 residues) expressed in baculovirus infecte...
Ligand InfoPC cidPC sid
In DepthDetails ArticlePubMed
TargetKallikrein-14(Homo sapiens (Human))
Glaxosmithkline
Curated by ChEMBL
LigandPNGBDBM50525901(CHEMBL4448315)
Affinity DataIC50:  3.16E+4nM. Assay description: Inhibition of recombinant human C-terminal 10-His-tagged KLK14 (Q19 to M248 residues) expressed in mouse NS0 cells using BOC-VPR-AMC as substrate inc...
Ligand InfoPC cidPC sid
In DepthDetails ArticlePubMed
TargetProthrombin(Homo sapiens (Human))
Glaxosmithkline
Curated by ChEMBL
LigandPNGBDBM50525901(CHEMBL4448315)
Affinity DataIC50:  1.58E+4nM. Assay description: Inhibition of human recombinant C-terminal 10-His-tagged thrombin (M1 to E622 residues) expressed in mouse NS0 cells using BOC-VPR-AMC as substrate i...
Ligand InfoPC cidPC sid
In DepthDetails ArticlePubMed
TargetNeutrophil elastase(Homo sapiens (Human))
Glaxosmithkline
Curated by ChEMBL
LigandPNGBDBM50525901(CHEMBL4448315)
Affinity DataIC50:  1.00E+5nM. Assay description: Inhibition of human neutrophil elastase using MeOSuc-AAPV-AMC as substrate incubated for 40 mins by FLINT assay
Ligand InfoPC cidPC sid
In DepthDetails ArticlePubMed
TargetKallikrein-5(Homo sapiens (Human))
Glaxosmithkline
Curated by ChEMBL
LigandPNGBDBM50525901(CHEMBL4448315)
Affinity DataIC50:  10nM. Assay description: Inhibition of human recombinant 6His-Q-FLAG-tagged KLK5 expressed in baculovirus infected Sf9 insect cells using (Tos-Gly-Pro-Arg)2[R110].2TFA as sub...
Ligand InfoPC cidPC sid
In DepthDetails ArticlePubMed
TargetSuppressor of tumorigenicity 14 protein(Homo sapiens (Human))
Glaxosmithkline
Curated by ChEMBL
LigandPNGBDBM50525901(CHEMBL4448315)
Affinity DataIC50:  3.98E+4nM. Assay description: Inhibition of recombinant human N-terminal Met and 6-His-tagged matriptase (G596 to V855 residues) expressed in Escherichia coli using Boc-QAR-AMC as...
Ligand InfoPC cidPC sid
In DepthDetails ArticlePubMed
TargetCoagulation factor X(Homo sapiens (Human))
Glaxosmithkline
Curated by ChEMBL
LigandPNGBDBM50525901(CHEMBL4448315)
Affinity DataIC50:  6.31E+4nM. Assay description: Inhibition of recombinant human C-terminal 10-His-tagged factor Xa (L24 to K488 residues) expressed in baculovirus infected Sf21 insect cells using M...
Ligand InfoPC cidPC sid
In DepthDetails ArticlePubMed
TargetKallikrein-7(Homo sapiens (Human))
Glaxosmithkline
Curated by ChEMBL
LigandPNGBDBM50525901(CHEMBL4448315)
Affinity DataIC50: <1.00E+5nM. Assay description: Inhibition of recombinant human C-terminal 10-His-tagged KLK7 (Glu23 to His252 residues) expressed in mouse NS0 cells using 5-FAM-E-A-L-Y-L-V-S-G-C(5...
Ligand InfoPC cidPC sid
In DepthDetails ArticlePubMed
TargetPlasma kallikrein(Homo sapiens (Human))
Glaxosmithkline
Curated by ChEMBL
LigandPNGBDBM50525901(CHEMBL4448315)
Affinity DataIC50:  794nM. Assay description: Inhibition of human C-terminal 6-His-tagged KLKB1 (G20-A638 residues) expressed in mouse NS0 cells using PFR-AMC as substrate incubated for 40 mins b...
Ligand InfoPC cidPC sid
In DepthDetails ArticlePubMed
TargetUrokinase-type plasminogen activator(Homo sapiens (Human))
Glaxosmithkline
Curated by ChEMBL
LigandPNGBDBM50525901(CHEMBL4448315)
Affinity DataIC50: <1.00E+5nM. Assay description: Inhibition of recombinant human C-terminal 10-His-tagged urokinase (M1 to L431 residues) expressed in mouse NS0 cells using Z-GGR-AMC as substrate in...
Ligand InfoPC cidPC sid
In DepthDetails ArticlePubMed