BDBM50526226 CHEMBL4559691
SMILES Cn1cc(NC(=O)c2cn(Cc3ccc(Cl)c(Cl)c3)c(=O)c3cnc(cc23)N2CCNCC2)cn1
InChI Key InChIKey=ZEVIDIAVNXOTJB-UHFFFAOYSA-N
Data  1 IC50  1 Kd
  Tab Delimited (TSV)   2D SDfile   Computed 3D by Vconf -m prep SDfile
Find this compound or compounds like it in BindingDB:
Activity Spreadsheet -- Enzyme Inhibition Constant Data from BindingDB
Found 2 hits for monomerid = 50526226
TargetFascin(Homo sapiens (human))
Cruk Beatson Institute
Curated by ChEMBL
LigandPNGBDBM50526226(CHEMBL4559691)
Affinity DataKd:  580nM. Assay description: Binding affinity to human fascin (1 to 493 residues) expressed in Escherichia coli BL21(DE3) pLysS by SPR assay
Ligand InfoPC cidPC sid
In DepthDetails ArticlePubMed
TargetFascin(Homo sapiens (human))
Cruk Beatson Institute
Curated by ChEMBL
LigandPNGBDBM50526226(CHEMBL4559691)
Affinity DataIC50:  630nM. Assay description: Inhibition of human (His8)2-tagged fascin (1 to 493 residues) expressed in Escherichia coli BL21(DE3) pLysS assessed as reduction in F-actin bundling...
Ligand InfoPC cidPC sid
In DepthDetails ArticlePubMed