BDBM50526232 CHEMBL4439645
SMILES Clc1ccc(Cn2cc(ccc2=O)C(=O)Nc2cnn(c2)C2CCNC2)cc1Cl
InChI Key InChIKey=MUFFNLSSBZMKEA-UHFFFAOYSA-N
Data  1 Kd
  Tab Delimited (TSV)   2D SDfile   Computed 3D by Vconf -m prep SDfile
Find this compound or compounds like it in BindingDB:
Activity Spreadsheet -- Enzyme Inhibition Constant Data from BindingDB
Found 1 hit for monomerid = 50526232
TargetFascin(Homo sapiens (human))
Cruk Beatson Institute
Curated by ChEMBL
LigandPNGBDBM50526232(CHEMBL4439645)
Affinity DataKd: >1.00E+5nM. Assay description: Binding affinity to human fascin (1 to 493 residues) expressed in Escherichia coli BL21(DE3) pLysS by SPR assay
Ligand InfoPC cidPC sid
In DepthDetails ArticlePubMed