BDBM50526243 CHEMBL4576435
SMILES Cn1cc(NC(=O)c2cn(Cc3ccc(Cl)c(Cl)c3)c(=O)c3ncccc23)cn1
InChI Key InChIKey=QUTNUPPIZCQZPI-UHFFFAOYSA-N
Data  1 Kd
  Tab Delimited (TSV)   2D SDfile   Computed 3D by Vconf -m prep SDfile
Find this compound or compounds like it in BindingDB:
Activity Spreadsheet -- Enzyme Inhibition Constant Data from BindingDB
Found 1 hit for monomerid = 50526243
TargetFascin(Homo sapiens (human))
Cruk Beatson Institute
Curated by ChEMBL
LigandPNGBDBM50526243(CHEMBL4576435)
Affinity DataKd: >1.00E+5nM. Assay description: Binding affinity to human fascin (1 to 493 residues) expressed in Escherichia coli BL21(DE3) pLysS by SPR assay
Ligand InfoPC cidPC sid
In DepthDetails ArticlePubMed