BDBM50526246 CHEMBL4539975
SMILES CN(c1cc2c(cn(Cc3ccc(Cl)c(Cl)c3)c(=O)c2cn1)C(=O)Nc1cnn(C)c1)S(C)(=O)=O
InChI Key InChIKey=IYYMVVBLQCZTBP-UHFFFAOYSA-N
Data  1 Kd
  Tab Delimited (TSV)   2D SDfile   Computed 3D by Vconf -m prep SDfile
Find this compound or compounds like it in BindingDB:
Activity Spreadsheet -- Enzyme Inhibition Constant Data from BindingDB
Found 1 hit for monomerid = 50526246
TargetFascin(Homo sapiens (human))
Cruk Beatson Institute
Curated by ChEMBL
LigandPNGBDBM50526246(CHEMBL4539975)
Affinity DataKd:  2.00E+3nM. Assay description: Binding affinity to human fascin (1 to 493 residues) expressed in Escherichia coli BL21(DE3) pLysS by SPR assay
Ligand InfoPC cidPC sid
In DepthDetails ArticlePubMed