BDBM50526726 CHEMBL4574361
SMILES Cn1cc(cn1)-c1cc(cc(c1)S(=O)(=O)c1csc(CN)n1)S(C)(=O)=O
InChI Key InChIKey=GWBDPFCIMFMMSN-UHFFFAOYSA-N
Data  8 IC50
  Tab Delimited (TSV)   2D SDfile   Computed 3D by Vconf -m prep SDfile
Find this compound or compounds like it in BindingDB:
Activity Spreadsheet -- Enzyme Inhibition Constant Data from BindingDB
Found 8 hits for monomerid = 50526726
TargetAmine oxidase [flavin-containing] A(Homo sapiens (Human))
University Of Manchester
Curated by ChEMBL
LigandPNGBDBM50526726(CHEMBL4574361)
Affinity DataIC50: >1.00E+5nM. Assay description: Inhibition of recombinant human MAOA expressed in baculovirus infected BTI insect cells using luminogenic MAO substrate measured after 1 hr by MAO-gl...
Ligand InfoPC cidPC sid
In DepthDetails ArticlePubMed
TargetLysyl oxidase homolog 2(Homo sapiens (Human))
University Of Manchester
Curated by ChEMBL
LigandPNGBDBM50526726(CHEMBL4574361)
Affinity DataIC50:  370nM. Assay description: Inhibition of human C-terminal His10-tagged LOXL2 (Met1 to Gln774 residues) expressed in mouse NS0 cells using cadaverine hydrochloride as substrate ...
Ligand InfoPC cidPC sid
In DepthDetails ArticlePubMed
TargetD-amino-acid oxidase(Sus scrofa (pig))
University Of Manchester
Curated by ChEMBL
LigandPNGBDBM50526726(CHEMBL4574361)
Affinity DataIC50: >1.00E+5nM. Assay description: Inhibition of porcine kidney DAO measured after 1 hrs by ROS-glo assay
Ligand InfoPC cidPC sid
In DepthDetails ArticlePubMed
TargetAmine oxidase [flavin-containing] B(Homo sapiens (Human))
University Of Manchester
Curated by ChEMBL
LigandPNGBDBM50526726(CHEMBL4574361)
Affinity DataIC50: >1.00E+5nM. Assay description: Inhibition of recombinant human MAOB expressed in baculovirus infected BTI insect cells using luminogenic MAO substrate measured after 1 hr by MAO-gl...
Ligand InfoPC cidPC sid
In DepthDetails ArticlePubMed
TargetLysyl oxidase homolog 2(Homo sapiens (Human))
University Of Manchester
Curated by ChEMBL
LigandPNGBDBM50526726(CHEMBL4574361)
Affinity DataIC50:  146nM. Assay description: Inhibition of human C-terminal His10-tagged LOXL2 (Met1 to Gln774 residues) expressed in mouse NS0 cells using cadaverine hydrochloride as substrate ...
Ligand InfoPC cidPC sid
In DepthDetails ArticlePubMed
TargetMembrane primary amine oxidase(Homo sapiens (Human))
University Of Manchester
Curated by ChEMBL
LigandPNGBDBM50526726(CHEMBL4574361)
Affinity DataIC50: >1.00E+5nM. Assay description: Inhibition of recombinant human SSAO expressed in CHO cells using luminogenic MAO substrate measured after 1 hr by MAO-glo assay
Ligand InfoPC cidPC sid
In DepthDetails ArticlePubMed
TargetLysyl oxidase homolog 3(Homo sapiens (Human))
University Of Manchester
Curated by ChEMBL
LigandPNGBDBM50526726(CHEMBL4574361)
Affinity DataIC50:  6.69E+3nM. Assay description: Inhibition of recombinant C-terminal His-tagged human LOXL3 (1 to 753 residues) expressed in CHO cells using cadaverine hydrochloride as substrate pr...
Ligand InfoPC cidPC sid
In DepthDetails ArticlePubMed
TargetLysyl oxidase homolog 2(Homo sapiens (Human))
University Of Manchester
Curated by ChEMBL
LigandPNGBDBM50526726(CHEMBL4574361)
Affinity DataIC50:  787nM. Assay description: Inhibition of human C-terminal His10-tagged LOXL2 (Met1 to Gln774 residues) expressed in mouse NS0 cells using cadaverine hydrochloride as substrate ...
Ligand InfoPC cidPC sid
In DepthDetails ArticlePubMed