BDBM50527019 CHEMBL15876
SMILES O=C(CCCc1ccccc1)NC1CCOC1=O
InChI Key InChIKey=FBUYEVACKSZURO-UHFFFAOYSA-N
Data  1 IC50
  Tab Delimited (TSV)   2D SDfile   Computed 3D by Vconf -m prep SDfile
Find this compound or compounds like it in BindingDB:
Activity Spreadsheet -- Enzyme Inhibition Constant Data from BindingDB
Found 1 hit for monomerid = 50527019
TargetTranscriptional activator protein LuxR(Vibrio fischeri)
Larkin University
Curated by ChEMBL
LigandPNGBDBM50527019(CHEMBL15876)
Affinity DataIC50:  2.00E+3nM. Assay description: Antagonist activity at Aliivibrio fischeri LuxR by luminescence method
Ligand InfoPC cidPC sid
In DepthDetails ArticlePubMed