BDBM50527145 CHEMBL4460705
SMILES Cc1nc2cc(nn2c(N2CCC(C)(C)CC2)c1C(OC(C)(C)C)C(O)=O)-c1ccccc1
InChI Key InChIKey=YYAGFKRZXPZDJF-UHFFFAOYSA-N
Data  1 KI
  Tab Delimited (TSV)   2D SDfile   Computed 3D by Vconf -m prep SDfile
Find this compound or compounds like it in BindingDB:
Activity Spreadsheet -- Enzyme Inhibition Constant Data from BindingDB
Found 1 hit for monomerid = 50527145
TargetIntegrase(Human immunodeficiency virus 1)
Bristol-Myers Squibb Research And Development
Curated by ChEMBL
LigandPNGBDBM50527145(CHEMBL4460705)
Affinity DataKi:  60nM. Assay description: Allosteric inhibition of [3H]-2-tert-butoxy-2-[2-methyl-4-(p-tolyl)-3-quinolyl]acetic acid binding to HIV1 integrase measured after 1 hr under dark c...
Ligand InfoPC cidPC sid
In DepthDetails ArticlePubMed