BDBM50527156 CHEMBL4551451
SMILES Cc1ccc(Nc2c(C(OC(C)(C)C)C(O)=O)c(C)nc3cc(nn23)-c2ccccc2)cc1
InChI Key InChIKey=YVYXUSAIGXSJJS-UHFFFAOYSA-N
Data  1 KI
  Tab Delimited (TSV)   2D SDfile   Computed 3D by Vconf -m prep SDfile
Find this compound or compounds like it in BindingDB:
Activity Spreadsheet -- Enzyme Inhibition Constant Data from BindingDB
Found 1 hit for monomerid = 50527156
TargetIntegrase(Human immunodeficiency virus 1)
Bristol-Myers Squibb Research And Development
Curated by ChEMBL
LigandPNGBDBM50527156(CHEMBL4551451)
Affinity DataKi: >4.00E+4nM. Assay description: Allosteric inhibition of [3H]-2-tert-butoxy-2-[2-methyl-4-(p-tolyl)-3-quinolyl]acetic acid binding to HIV1 integrase measured after 1 hr under dark c...
Ligand InfoPC cidPC sid
In DepthDetails ArticlePubMed