BDBM50529769 CHEMBL4443643
SMILES CC(C)c1cccc(NC(=O)c2ccc(C)c(c2)-c2ccc3cn[nH]c3c2)c1
InChI Key InChIKey=UEMCXDRGXXMDCL-UHFFFAOYSA-N
Data  2 IC50
  Tab Delimited (TSV)   2D SDfile   Computed 3D by Vconf -m prep SDfile
Find this compound or compounds like it in BindingDB:
Activity Spreadsheet -- Enzyme Inhibition Constant Data from BindingDB
Found 2 hits for monomerid = 50529769
TargetDiscoidin domain-containing receptor 2(Homo sapiens (Human))
Chinese Academy Of Sciences
Curated by ChEMBL
LigandPNGBDBM50529769(CHEMBL4443643)
Affinity DataIC50:  1.20nM. Assay description: Inhibition of DDR2 (unknown origin) using poly (Glu, Tyr) 4:1 substrate after 60 mins by ELISA
Ligand InfoPC cidPC sid
In DepthDetails ArticlePubMed
TargetDiscoidin domain-containing receptor 2(Homo sapiens (Human))
Chinese Academy Of Sciences
Curated by ChEMBL
LigandPNGBDBM50529769(CHEMBL4443643)
Affinity DataIC50:  1.20nM. Assay description: Inhibition of DDR2 (unknown origin) using poly (Glu, Tyr) 4:1 substrate after 60 mins by ELISA
Ligand InfoPC cidPC sid
In DepthDetails ArticlePubMed