BDBM50530469 CHEMBL4442276
SMILES [H][C@@]12CCc3cc(ccc3[C@@]1(C)CCC[C@@]2(C)CNC(=O)Nc1ccc(C)c(NC(=O)NC[C@]2(C)CCC[C@]3(C)c4ccc(cc4CC[C@@]23[H])C(C)C)c1)C(C)C
InChI Key InChIKey=HTFIKJVKPJTXHW-HBPKSMBPSA-N
Data  4 IC50
  Tab Delimited (TSV)   2D SDfile   Computed 3D by Vconf -m prep SDfile
Find this compound or compounds like it in BindingDB:
Activity Spreadsheet -- Enzyme Inhibition Constant Data from BindingDB
Found 4 hits for monomerid = 50530469
TargetTyrosyl-DNA phosphodiesterase 1(Homo sapiens (Human))
Siberian Branch Of The Russian Academy Of Sciences
Curated by ChEMBL
LigandPNGBDBM50530469(CHEMBL4442276)
Affinity DataIC50:  5.40E+3nM. Assay description: Inhibition of recombinant TDP1 H493R mutant (unknown origin) using 5'-(5,6 FAM-aac gtc agg gtc ttc c-BHQ1)-3' as substrate measured every 55 secs for...
Ligand InfoPC cidPC sid
In DepthDetails ArticlePubMed
TargetTyrosyl-DNA phosphodiesterase 1(Homo sapiens (Human))
Siberian Branch Of The Russian Academy Of Sciences
Curated by ChEMBL
LigandPNGBDBM50530469(CHEMBL4442276)
Affinity DataIC50:  110nM. Assay description: Inhibition of recombinant TDP1 (unknown origin) using 5'-(5,6 FAM-aac gtc agg gtc ttc c-BHQ1)-3' as substrate measured every 55 secs for 8 mins by fl...
Ligand InfoPC cidPC sid
In DepthDetails ArticlePubMed
TargetTyrosyl-DNA phosphodiesterase 1(Homo sapiens (Human))
Siberian Branch Of The Russian Academy Of Sciences
Curated by ChEMBL
LigandPNGBDBM50530469(CHEMBL4442276)
Affinity DataIC50:  5.40E+3nM. Assay description: Inhibition of recombinant TDP1 H493R mutant (unknown origin) using 5'-(5,6 FAM-aac gtc agg gtc ttc c-BHQ1)-3' as substrate measured every 55 secs for...
Ligand InfoPC cidPC sid
In DepthDetails ArticlePubMed
TargetTyrosyl-DNA phosphodiesterase 1(Homo sapiens (Human))
Siberian Branch Of The Russian Academy Of Sciences
Curated by ChEMBL
LigandPNGBDBM50530469(CHEMBL4442276)
Affinity DataIC50:  110nM. Assay description: Inhibition of recombinant TDP1 (unknown origin) using 5'-(5,6 FAM-aac gtc agg gtc ttc c-BHQ1)-3' as substrate measured every 55 secs for 8 mins by fl...
Ligand InfoPC cidPC sid
In DepthDetails ArticlePubMed