BDBM50531272 CHEMBL4438424
SMILES [H][C@@]1(O[C@@H]2O[C@H](CO)[C@@H](O)[C@H](O)[C@H]2O)OC=C2C(=O)N3CCc4c([nH]c5ccccc45)[C@]3([H])C[C@@]2([H])[C@H]1C=C
InChI Key InChIKey=LBRPLJCNRZUXLS-IUNANRIWSA-N
Data  2 EC50
  Tab Delimited (TSV)   2D SDfile   Computed 3D by Vconf -m prep SDfile
Find this compound or compounds like it in BindingDB:
Activity Spreadsheet -- Enzyme Inhibition Constant Data from BindingDB
Found 2 hits for monomerid = 50531272
Target5-hydroxytryptamine receptor 1A(Homo sapiens (Human))
Dalian Medical University
Curated by ChEMBL
LigandPNGBDBM50531272(CHEMBL4438424)
Affinity DataEC50: >1.00E+5nM. Assay description: Agonist activity at human 5HT1A receptor expressed in CHOK1 cells incubated for 16 hrs followed by forskolin-stimulation and measured after 2 hrs by ...
In DepthDetails ArticlePubMed
Target5-hydroxytryptamine receptor 1A(Homo sapiens (Human))
Dalian Medical University
Curated by ChEMBL
LigandPNGBDBM50531272(CHEMBL4438424)
Affinity DataEC50: >1.00E+5nM. Assay description: Agonist activity at human 5HT1A receptor expressed in CHOK1 cells incubated for 16 hrs followed by forskolin-stimulation and measured after 2 hrs by ...
In DepthDetails ArticlePubMed