BDBM50531935 CHEMBL4562397
SMILES Brc1cccc(c1)C(=O)NNC(=S)NC(=O)c1ccccc1
InChI Key InChIKey=XBGDYFJFYGSHRB-UHFFFAOYSA-N
Data  1 KI
  Tab Delimited (TSV)   2D SDfile   Computed 3D by Vconf -m prep SDfile
Find this compound or compounds like it in BindingDB:
Activity Spreadsheet -- Enzyme Inhibition Constant Data from BindingDB
Found 1 hit for monomerid = 50531935
TargetFructose-bisphosphate aldolase class 2(Synechocystis sp. (strain PCC 6803 / Kazusa))
International Cooperation Base Of Pesticide And Green Synthesis (Hubei)
Curated by ChEMBL
LigandPNGBDBM50531935(CHEMBL4562397)
Affinity DataKi:  3.10E+3nM. Assay description: Inhibition of recombinant Synechocystis sp. PCC 6803 FBA2 expressed in Escherichia coli BL21 (DE3) using FBP as substrate measured over 5 mins
Ligand InfoPC cidPC sid
In DepthDetails ArticlePubMed