BDBM50531973 CHEMBL4534867
SMILES CC(C)c1ccc(cc1)C(=O)C1CCN(CC1)C(=O)c1ccc(F)c(O)c1
InChI Key InChIKey=BFSWPHDXOKWWQJ-UHFFFAOYSA-N
Data  6 IC50
  Tab Delimited (TSV)   2D SDfile   Computed 3D by Vconf -m prep SDfile
Find this compound or compounds like it in BindingDB:
Activity Spreadsheet -- Enzyme Inhibition Constant Data from BindingDB
Found 6 hits for monomerid = 50531973
TargetCannabinoid receptor 2(Homo sapiens (Human))
University Of Pisa
Curated by ChEMBL
LigandPNGBDBM50531973(CHEMBL4534867)
Affinity DataIC50: >1.00E+4nM. Assay description: Displacement of [3H]CP55,940 to human CB2 receptor expressed in cell membranes after 90 mins by liquid scintillation counting
Ligand InfoPC cidPC sid
In DepthDetails ArticlePubMed
TargetLysophosphatidylserine lipase ABHD12(Homo sapiens (Human))
University Of Pisa
Curated by ChEMBL
LigandPNGBDBM50531973(CHEMBL4534867)
Affinity DataIC50: >1.00E+4nM. Assay description: Inhibition of human ABHD12 expressed in HEK293 cell homogenates pre-incubated for 30 mins in presence of [1,2,3-3H]2-OG by liquid scintillation spect...
Ligand InfoPC cidPC sid
In DepthDetails ArticlePubMed
TargetCannabinoid receptor 1(Homo sapiens (Human))
University Of Pisa
Curated by ChEMBL
LigandPNGBDBM50531973(CHEMBL4534867)
Affinity DataIC50: >1.00E+4nM. Assay description: Displacement of [3H]CP55,940 to human CB1 receptor expressed in cell membranes after 90 mins by liquid scintillation counting
Ligand InfoPC cidPC sid
In DepthDetails ArticlePubMed
TargetMonoacylglycerol lipase ABHD6(Homo sapiens (Human))
University Of Pisa
Curated by ChEMBL
LigandPNGBDBM50531973(CHEMBL4534867)
Affinity DataIC50: >1.00E+4nM. Assay description: Inhibition of human ABHD6 expressed in HEK293 cell homogenates pre-incubated for 30 mins in presence of [1,2,3-3H]2-OG by liquid scintillation spectr...
Ligand InfoPC cidPC sid
In DepthDetails ArticlePubMed
TargetFatty-acid amide hydrolase 1(Homo sapiens (Human))
University Of Pisa
Curated by ChEMBL
LigandPNGBDBM50531973(CHEMBL4534867)
Affinity DataIC50:  1.00E+3nM. Assay description: Inhibition of FAAH in human U937 cell homogenates using [ethanolamine-1-3H]AEA as substrate after 15 mins by liquid scintillation spectroscopy
Ligand InfoPC cidPC sid
In DepthDetails ArticlePubMed
TargetMonoglyceride lipase(Homo sapiens (Human))
University Of Pisa
Curated by ChEMBL
LigandPNGBDBM50531973(CHEMBL4534867)
Affinity DataIC50:  110nM. Assay description: Inhibition of human recombinant MAGL using 4-NPA as substrate after 30 mins
Ligand InfoPC cidPC sid
In DepthDetails ArticlePubMed