BDBM50534300 CHEMBL4442125
SMILES Fc1ccc(COc2cccc(c2)-c2cn(nn2)[C@@H]2CN3CCC2CC3)cc1
InChI Key InChIKey=KBCGDBMDBJDDGG-JOCHJYFZSA-N
Data  3 KI
  Tab Delimited (TSV)   2D SDfile   Computed 3D by Vconf -m prep SDfile
Find this compound or compounds like it in BindingDB:
Activity Spreadsheet -- Enzyme Inhibition Constant Data from BindingDB
Found 3 hits for monomerid = 50534300
TargetNeuronal acetylcholine receptor subunit alpha-3/beta-4(Homo sapiens (Human))
Mahidol University
Curated by ChEMBL
LigandPNGBDBM50534300(CHEMBL4442125)
Affinity DataKi:  7.20nM. Assay description: Displacement of [3H]epibatidine from human alpha3beta4 nAChR transfected in HEK293 cell membranes after 120 mins by liquid scintillation counting
Ligand InfoPC cidPC sid
In DepthDetails ArticlePubMed
TargetNeuronal acetylcholine receptor subunit alpha-7(Homo sapiens (Human))
Mahidol University
Curated by ChEMBL
LigandPNGBDBM50534300(CHEMBL4442125)
Affinity DataKi:  149nM. Assay description: Displacement of [3H]MLA from human alpha7 nAChR transfected in human SH-SY5Y cell membranes after 120 mins by liquid scintillation counting
Ligand InfoPC cidPC sid
In DepthDetails ArticlePubMed
TargetNeuronal acetylcholine receptor subunit alpha-4/beta-2(Homo sapiens (Human))
Mahidol University
Curated by ChEMBL
LigandPNGBDBM50534300(CHEMBL4442125)
Affinity DataKi:  537nM. Assay description: Displacement of [3H]epibatidine from human alpha4beta2 nAChR transfected in HEK293 cell membranes after 120 mins by liquid scintillation counting
Ligand InfoPC cidPC sid
In DepthDetails ArticlePubMed