BDBM50534305 CHEMBL4435570
SMILES OC1=C(Sc2ccccc2Cl)C(=O)NC(C1)(c1ccsc1)c1cccc(NC2CCCCC2)c1
InChI Key InChIKey=XEUOYSJUMPOCNI-UHFFFAOYSA-N
Data  2 IC50
  Tab Delimited (TSV)   2D SDfile   Computed 3D by Vconf -m prep SDfile
Find this compound or compounds like it in BindingDB:
Activity Spreadsheet -- Enzyme Inhibition Constant Data from BindingDB
Found 2 hits for monomerid = 50534305
TargetL-lactate dehydrogenase A chain(Homo sapiens (Human))
Genentech
Curated by ChEMBL
LigandPNGBDBM50534305(CHEMBL4435570)
Affinity DataIC50:  4nM. Assay description: Inhibition of human recombinant carboxy-terminal His-tagged LDHA by UV endpoint assay
Ligand InfoPC cidPC sid
In DepthDetails ArticlePubMed
TargetL-lactate dehydrogenase B chain(Homo sapiens (Human))
Genentech
Curated by ChEMBL
LigandPNGBDBM50534305(CHEMBL4435570)
Affinity DataIC50:  77nM. Assay description: Inhibition of human recombinant carboxy-terminal His-tagged LDHB by UV endpoint assay
Ligand InfoPC cidPC sid
In DepthDetails ArticlePubMed