BDBM50535682 CHEMBL4580661
SMILES CCOC(=O)Nc1ccc(NCc2ccc(F)cc2)c(F)c1N
InChI Key InChIKey=JXVLPDQFZKOEPI-UHFFFAOYSA-N
Data  1 EC50
  Tab Delimited (TSV)   2D SDfile   Computed 3D by Vconf -m prep SDfile
Find this compound or compounds like it in BindingDB:
Activity Spreadsheet -- Enzyme Inhibition Constant Data from BindingDB
Found 1 hit for monomerid = 50535682
TargetPotassium voltage-gated channel subfamily KQT member 2/3(Homo sapiens (Human))
University Of Pittsburgh
Curated by ChEMBL
LigandPNGBDBM50535682(CHEMBL4580661)
Affinity DataEC50:  600nM. Assay description: Agonist activity at human Kv7.2/Kv7.3 expressed in CHO cells at holding potential of at -85 mV by whole cell patch clamp electrophysiology assay
Ligand InfoPC cidPC sid
In DepthDetails ArticlePubMed