BDBM50538523 CHEMBL4646013
SMILES N[C@]1(C[C@]2(CCNC2)C[C@@H]1CCCB(O)O)C(O)=O
InChI Key InChIKey=QZLUPYXYXWEXHN-DLOVCJGASA-N
Data  1 IC50
  Tab Delimited (TSV)   2D SDfile   Computed 3D by Vconf -m prep SDfile
Find this compound or compounds like it in BindingDB:
Activity Spreadsheet -- Enzyme Inhibition Constant Data from BindingDB
Found 1 hit for monomerid = 50538523
TargetArginase-1(Homo sapiens (Human))
Merck
Curated by ChEMBL
LigandPNGBDBM50538523(CHEMBL4646013)
Affinity DataIC50:  13nM. Assay description: Inhibition of human arginase1 in presence of DNTB by thio ornithine generation assay
Ligand InfoPC cidPC sid
In DepthDetails ArticlePubMed