BDBM50538528 CHEMBL4639175
SMILES [H][C@]12CN(C)C[C@@]1([H])[C@H](CCCB(O)O)[C@@](N)(C2)C(O)=O
InChI Key InChIKey=LYMIUTLVAAOMIF-WYFGTUCQSA-N
Data  1 IC50
  Tab Delimited (TSV)   2D SDfile   Computed 3D by Vconf -m prep SDfile
Find this compound or compounds like it in BindingDB:
Activity Spreadsheet -- Enzyme Inhibition Constant Data from BindingDB
Found 1 hit for monomerid = 50538528
TargetArginase-1(Homo sapiens (Human))
Merck
Curated by ChEMBL
LigandPNGBDBM50538528(CHEMBL4639175)
Affinity DataIC50:  83nM. Assay description: Inhibition of human arginase1 in presence of DNTB by thio ornithine generation assay
Ligand InfoPC cidPC sid
In DepthDetails ArticlePubMed