BDBM50538540 CHEMBL4638209
SMILES [H][C@]12C[C@@H](C[C@@]1([H])[C@H](CCCB(O)O)[C@@](N)(C2)C(O)=O)NC(=O)[C@@H](N)C(C)C
InChI Key InChIKey=KHNQPIRRLYYQNZ-GGNGKRJCSA-N
Data  2 IC50
  Tab Delimited (TSV)   2D SDfile   Computed 3D by Vconf -m prep SDfile
Find this compound or compounds like it in BindingDB:
Activity Spreadsheet -- Enzyme Inhibition Constant Data from BindingDB
Found 2 hits for monomerid = 50538540
TargetArginase-1(Homo sapiens (Human))
Merck
Curated by ChEMBL
LigandPNGBDBM50538540(CHEMBL4638209)
Affinity DataIC50:  32nM. Assay description: Inhibition of arginase1 in human cancer patient serum
Ligand InfoPC cidPC sid
In DepthDetails ArticlePubMed
TargetArginase-1(Homo sapiens (Human))
Merck
Curated by ChEMBL
LigandPNGBDBM50538540(CHEMBL4638209)
Affinity DataIC50:  522nM. Assay description: Inhibition of human arginase1 in presence of DNTB by thio ornithine generation assay
Ligand InfoPC cidPC sid
In DepthDetails ArticlePubMed