BDBM50538543 CHEMBL4632493
SMILES [H][C@@]12C[C@](N)([C@@H](CCCB(O)O)[C@]1([H])C[C@H](NC)[C@H]2F)C(O)=O
InChI Key InChIKey=MGCHZOBLCXFANK-JXMGNPHCSA-N
Data  1 IC50
  Tab Delimited (TSV)   2D SDfile   Computed 3D by Vconf -m prep SDfile
Find this compound or compounds like it in BindingDB:
Activity Spreadsheet -- Enzyme Inhibition Constant Data from BindingDB
Found 1 hit for monomerid = 50538543
TargetArginase-1(Homo sapiens (Human))
Merck
Curated by ChEMBL
LigandPNGBDBM50538543(CHEMBL4632493)
Affinity DataIC50:  14nM. Assay description: Inhibition of human arginase1 in presence of DNTB by thio ornithine generation assay
Ligand InfoPC cidPC sid
In DepthDetails ArticlePubMed