BDBM50538546 CHEMBL4645115
SMILES [H][C@]12C[C@H](O)[C@H](F)[C@@]1([H])[C@H](CCCB(O)O)[C@@](N)(C2)C(O)=O
InChI Key InChIKey=XHTFRXDGTZYREP-WVFNQNJUSA-N
Data  1 IC50
  Tab Delimited (TSV)   2D SDfile   Computed 3D by Vconf -m prep SDfile
Find this compound or compounds like it in BindingDB:
Activity Spreadsheet -- Enzyme Inhibition Constant Data from BindingDB
Found 1 hit for monomerid = 50538546
TargetArginase-1(Homo sapiens (Human))
Merck
Curated by ChEMBL
LigandPNGBDBM50538546(CHEMBL4645115)
Affinity DataIC50:  220nM. Assay description: Inhibition of human arginase1 in presence of DNTB by thio ornithine generation assay
Ligand InfoPC cidPC sid
In DepthDetails ArticlePubMed