BDBM50538804 CHEMBL4634131
SMILES Cl.CC(C)(CCc1cccc(O)c1)NC[C@H](O)c1cc(O)cc2NC(=O)COc12
InChI Key InChIKey=QZZQNYSUVCVWOK-FERBBOLQSA-N
Data  2 EC50
  Tab Delimited (TSV)   2D SDfile   Computed 3D by Vconf -m prep SDfile
Find this compound or compounds like it in BindingDB:
Activity Spreadsheet -- Enzyme Inhibition Constant Data from BindingDB
Found 2 hits for monomerid = 50538804
TargetBeta-1 adrenergic receptor(Homo sapiens (Human))
Shenyang Pharmaceutical University
Curated by ChEMBL
LigandPNGBDBM50538804(CHEMBL4634131)
Affinity DataEC50:  36nM. Assay description: Agonist activity at human beta1 adrenoreceptor overexpressed in human HEK293 cells assessed as cAMP accumulation incubated for 60 mins by HTRF assay
Ligand InfoPC cidPC sid
In DepthDetails ArticlePubMed
TargetBeta-2 adrenergic receptor(Homo sapiens (Human))
Shenyang Pharmaceutical University
Curated by ChEMBL
LigandPNGBDBM50538804(CHEMBL4634131)
Affinity DataEC50:  0.0162nM. Assay description: Agonist activity at human beta2 adrenoreceptor overexpressed in human HEK293 cells assessed as cAMP accumulation incubated for 60 mins by HTRF assay
Ligand InfoPC cidPC sid
In DepthDetails ArticlePubMed