BDBM50539455 CHEMBL4639114
SMILES [H][C@]12CCC[C@]([H])(C[C@H](C1)NC(=O)c1cc(OC)c(OC)c(OC)c1)N2CC(=O)Nc1cc(C)ccc1C
InChI Key InChIKey=JDQHNZWJEMDJDN-DKUWSORSSA-N
Data  2 IC50
  Tab Delimited (TSV)   2D SDfile   Computed 3D by Vconf -m prep SDfile
Find this compound or compounds like it in BindingDB:
Activity Spreadsheet -- Enzyme Inhibition Constant Data from BindingDB
Found 2 hits for monomerid = 50539455
TargetC-X-C chemokine receptor type 6(Homo sapiens)
Sanford Burnham Prebys Medical Discovery Institute
Curated by ChEMBL
LigandPNGBDBM50539455(CHEMBL4639114)
Affinity DataIC50:  1.65E+4nM. Assay description: Antagonist activity at Prolink-tagged human CXCR6 receptor assessed as inhibition of forskolin-induced cAMP accumulation by DiscoveRx cell based assa...
Ligand InfoPC cidPC sid
In DepthDetails ArticlePubMed
TargetC-X-C chemokine receptor type 6(Homo sapiens)
Sanford Burnham Prebys Medical Discovery Institute
Curated by ChEMBL
LigandPNGBDBM50539455(CHEMBL4639114)
Affinity DataIC50:  610nM. Assay description: Antagonist activity at Prolink-tagged human CXCR6 receptor assessed as inhibition of CXCL16-induced beta-arrestin recruitment by DiscoveRx cell based...
Ligand InfoPC cidPC sid
In DepthDetails ArticlePubMed