BDBM50540241 CHEMBL4636983
SMILES COC(=O)Cn1nnc(c1-c1ccc(CN2CCOCC2)cc1)-c1cc(C(C)C)c(O)cc1O
InChI Key InChIKey=DCXVUQSMBOCIKC-UHFFFAOYSA-N
Data  3 IC50
  Tab Delimited (TSV)   2D SDfile   Computed 3D by Vconf -m prep SDfile
Find this compound or compounds like it in BindingDB:
Activity Spreadsheet -- Enzyme Inhibition Constant Data from BindingDB
Found 3 hits for monomerid = 50540241
TargetHeat shock protein HSP 90-alpha(Homo sapiens (Human))
Daegu-Gyeongbuk Medical Innovation Foundation (Dgmif)
Curated by ChEMBL
LigandPNGBDBM50540241(CHEMBL4636983)
Affinity DataIC50:  91nM. Assay description: Inhibition of recombinant HSP90alpha (unknown origin) incubated for 24 hrs in presence of 1-FITC3 probe by fluorescence polarization assay
Ligand InfoPC cidPC sid
In DepthDetails ArticlePubMed
TargetEndoplasmin(Homo sapiens (Human))
Daegu-Gyeongbuk Medical Innovation Foundation (Dgmif)
Curated by ChEMBL
LigandPNGBDBM50540241(CHEMBL4636983)
Affinity DataIC50:  197nM. Assay description: Inhibition of GRP94 (unknown origin)
Ligand InfoPC cidPC sid
In DepthDetails ArticlePubMed
TargetHeat shock protein 75 kDa, mitochondrial(Homo sapiens (Human))
Daegu-Gyeongbuk Medical Innovation Foundation (Dgmif)
Curated by ChEMBL
LigandPNGBDBM50540241(CHEMBL4636983)
Affinity DataIC50:  2.45E+4nM. Assay description: Inhibition of TRAP1 (unknown origin)
Ligand InfoPC cidPC sid
In DepthDetails ArticlePubMed