BDBM50545998 CHEMBL4745050
SMILES OC(=O)c1ccccc1NC(=O)c1ccc(SC(F)(F)F)cc1
InChI Key InChIKey=SECKWVXVFOVUIC-UHFFFAOYSA-N
Data  2 EC50
  Tab Delimited (TSV)   2D SDfile   Computed 3D by Vconf -m prep SDfile
Find this compound or compounds like it in BindingDB:
Activity Spreadsheet -- Enzyme Inhibition Constant Data from BindingDB
Found 2 hits for monomerid = 50545998
TargetPotassium channel subfamily K member 2(Homo sapiens (Human))
Ono Pharmaceutical
Curated by ChEMBL
LigandPNGBDBM50545998(CHEMBL4745050)
Affinity DataEC50:  1.28E+4nM. Assay description: Activation of human TREK1 by thallium flux mobilization assay
Ligand InfoPC cidPC sid
In DepthDetails ArticlePubMed
TargetPotassium channel subfamily K member 10(Homo sapiens (Human))
Ono Pharmaceutical
Curated by ChEMBL
LigandPNGBDBM50545998(CHEMBL4745050)
Affinity DataEC50:  5.00E+3nM. Assay description: Activation of human TREK2 by thallium flux mobilization assay
Ligand InfoPC cidPC sid
In DepthDetails ArticlePubMed