BDBM50546006 CHEMBL4747514
SMILES COc1ccc(NC(=O)c2ccc(SC(F)(F)F)cc2)c(c1)C(O)=O
InChI Key InChIKey=LMRSRPGCWLTGMK-UHFFFAOYSA-N
Data  2 EC50
  Tab Delimited (TSV)   2D SDfile   Computed 3D by Vconf -m prep SDfile
Find this compound or compounds like it in BindingDB:
Activity Spreadsheet -- Enzyme Inhibition Constant Data from BindingDB
Found 2 hits for monomerid = 50546006
TargetPotassium channel subfamily K member 2(Homo sapiens (Human))
Ono Pharmaceutical
Curated by ChEMBL
LigandPNGBDBM50546006(CHEMBL4747514)
Affinity DataEC50:  2.02E+4nM. Assay description: Activation of human TREK1 by thallium flux mobilization assay
Ligand InfoPC cidPC sid
In DepthDetails ArticlePubMed
TargetPotassium channel subfamily K member 10(Homo sapiens (Human))
Ono Pharmaceutical
Curated by ChEMBL
LigandPNGBDBM50546006(CHEMBL4747514)
Affinity DataEC50: >3.00E+4nM. Assay description: Activation of human TREK2 by thallium flux mobilization assay
Ligand InfoPC cidPC sid
In DepthDetails ArticlePubMed