BDBM50546778 CHEMBL4753207
SMILES [H][C@@]12CCCN1C(=O)[C@H](C)NC(=O)[C@H](CC(C)C)NC(=O)[C@H](COCCCCOC[C@H](NC2=O)C(=O)N(C)C)NC(=O)c1cccc(OCC2CCCCC2)c1
InChI Key InChIKey=YIISNMQUFQDCMB-YNUAGZMFSA-N
Data  1 KI
  Tab Delimited (TSV)   2D SDfile   Computed 3D by Vconf -m prep SDfile
Find this compound or compounds like it in BindingDB:
Activity Spreadsheet -- Enzyme Inhibition Constant Data from BindingDB
Found 1 hit for monomerid = 50546778
TargetTelomeric repeat-binding factor 2(Homo sapiens)
China Pharmaceutical University
Curated by ChEMBL
LigandPNGBDBM50546778(CHEMBL4753207)
Affinity DataKi:  2.90E+4nM. Assay description: Binding affinity to TRFH domain of TRF2 (residues 42 to 245) (unknown origin) by FP based assay
Ligand InfoPC cidPC sid
In DepthDetails PubMed