BDBM50547130 CHEMBL1701986
SMILES OCc1cc(=O)c(O)c(o1)C(Nc1ccccn1)c1ccccc1F
InChI Key InChIKey=IUEFYIIYHYEQMM-UHFFFAOYSA-N
Data  3 IC50
  Tab Delimited (TSV)   2D SDfile   Computed 3D by Vconf -m prep SDfile
Find this compound or compounds like it in BindingDB:
Activity Spreadsheet -- Enzyme Inhibition Constant Data from BindingDB
Found 3 hits for monomerid = 50547130
TargetTranscriptional enhancer factor TEF-3(Homo sapiens)
Max Planck Institute Of Molecular Physiology
Curated by ChEMBL
LigandPNGBDBM50547130(CHEMBL1701986)
Affinity DataIC50:  3.20E+3nM. Assay description: Inhibition of CPM binding to N-terminal His6-tagged human TEAD4 (217 to 434 residues) expressed in Escherichia coli BL21-CodonPlus (DE3)-RIPL cells p...
Ligand InfoPC cidPC sid
In DepthDetails ArticlePubMed
TargetTranscriptional enhancer factor TEF-3(Homo sapiens)
Max Planck Institute Of Molecular Physiology
Curated by ChEMBL
LigandPNGBDBM50547130(CHEMBL1701986)
Affinity DataIC50:  300nM. Assay description: Inhibition of FITC-labeled palmitate tracer binding to N-terminal His6-tagged human TEAD4 (217 to 434 residues) expressed in Escherichia coli BL21-Co...
Ligand InfoPC cidPC sid
In DepthDetails ArticlePubMed
TargetTranscriptional enhancer factor TEF-3(Homo sapiens)
Max Planck Institute Of Molecular Physiology
Curated by ChEMBL
LigandPNGBDBM50547130(CHEMBL1701986)
Affinity DataIC50:  3.20E+3nM. Assay description: Inhibition of CPM binding to N-terminal His6-tagged human TEAD4 (217 to 434 residues) expressed in Escherichia coli BL21-CodonPlus (DE3)-RIPL cells p...
Ligand InfoPC cidPC sid
In DepthDetails ArticlePubMed