BDBM50547137 CHEMBL4750499
SMILES OCc1cc(=O)c(O)c(o1)C(Nc1cccc(F)c1)c1ccccn1
InChI Key InChIKey=VSUVXGKNLZCZPD-UHFFFAOYSA-N
Data  1 IC50
  Tab Delimited (TSV)   2D SDfile   Computed 3D by Vconf -m prep SDfile
Find this compound or compounds like it in BindingDB:
Activity Spreadsheet -- Enzyme Inhibition Constant Data from BindingDB
Found 1 hit for monomerid = 50547137
TargetTranscriptional enhancer factor TEF-3(Homo sapiens)
Max Planck Institute Of Molecular Physiology
Curated by ChEMBL
LigandPNGBDBM50547137(CHEMBL4750499)
Affinity DataIC50:  8.70E+3nM. Assay description: Inhibition of CPM binding to N-terminal His6-tagged human TEAD4 (217 to 434 residues) expressed in Escherichia coli BL21-CodonPlus (DE3)-RIPL cells p...
Ligand InfoPC cidPC sid
In DepthDetails ArticlePubMed