BDBM50547154 CHEMBL4745831
SMILES OCc1cc(=O)c(O)c(o1)C(Nc1cccc(F)c1)c1ccccc1
InChI Key InChIKey=ZCCQOQXABVTUEK-UHFFFAOYSA-N
Data  2 IC50
  Tab Delimited (TSV)   2D SDfile   Computed 3D by Vconf -m prep SDfile
Find this compound or compounds like it in BindingDB:
Activity Spreadsheet -- Enzyme Inhibition Constant Data from BindingDB
Found 2 hits for monomerid = 50547154
TargetTranscriptional enhancer factor TEF-3(Homo sapiens)
Max Planck Institute Of Molecular Physiology
Curated by ChEMBL
LigandPNGBDBM50547154(CHEMBL4745831)
Affinity DataIC50:  200nM. Assay description: Inhibition of FITC-labeled palmitate tracer binding to N-terminal His6-tagged human TEAD4 (217 to 434 residues) expressed in Escherichia coli BL21-Co...
Ligand InfoPC cidPC sid
In DepthDetails ArticlePubMed
TargetTranscriptional enhancer factor TEF-3(Homo sapiens)
Max Planck Institute Of Molecular Physiology
Curated by ChEMBL
LigandPNGBDBM50547154(CHEMBL4745831)
Affinity DataIC50:  1.50E+3nM. Assay description: Inhibition of CPM binding to N-terminal His6-tagged human TEAD4 (217 to 434 residues) expressed in Escherichia coli BL21-CodonPlus (DE3)-RIPL cells p...
Ligand InfoPC cidPC sid
In DepthDetails ArticlePubMed