BDBM50547156 CHEMBL4783341
SMILES Cc1ccnc(NC(c2ccccc2)c2oc(CO)cc(=O)c2O)c1
InChI Key InChIKey=LUTGZLXZDBXVSC-UHFFFAOYSA-N
Data  2 IC50
  Tab Delimited (TSV)   2D SDfile   Computed 3D by Vconf -m prep SDfile
Find this compound or compounds like it in BindingDB:
Activity Spreadsheet -- Enzyme Inhibition Constant Data from BindingDB
Found 2 hits for monomerid = 50547156
TargetTranscriptional enhancer factor TEF-3(Homo sapiens)
Max Planck Institute Of Molecular Physiology
Curated by ChEMBL
LigandPNGBDBM50547156(CHEMBL4783341)
Affinity DataIC50:  300nM. Assay description: Inhibition of FITC-labeled palmitate tracer binding to N-terminal His6-tagged human TEAD4 (217 to 434 residues) expressed in Escherichia coli BL21-Co...
Ligand InfoPC cidPC sid
In DepthDetails ArticlePubMed
TargetTranscriptional enhancer factor TEF-3(Homo sapiens)
Max Planck Institute Of Molecular Physiology
Curated by ChEMBL
LigandPNGBDBM50547156(CHEMBL4783341)
Affinity DataIC50:  2.40E+3nM. Assay description: Inhibition of CPM binding to N-terminal His6-tagged human TEAD4 (217 to 434 residues) expressed in Escherichia coli BL21-CodonPlus (DE3)-RIPL cells p...
Ligand InfoPC cidPC sid
In DepthDetails ArticlePubMed