BDBM50551373 CHEMBL4795995
SMILES O=S(=O)(N[C@@H]1CCN(CCCc2noc3ccccc23)C1)c1cc2ccccc2s1
InChI Key InChIKey=HEEFMGUIOXQXAL-QGZVFWFLSA-N
Data  4 KI
  Tab Delimited (TSV)   2D SDfile   Computed 3D by Vconf -m prep SDfile
Find this compound or compounds like it in BindingDB:
Activity Spreadsheet -- Enzyme Inhibition Constant Data from BindingDB
Found 4 hits for monomerid = 50551373
TargetD(2) dopamine receptor(Homo sapiens (Human))
Jagiellonian University Medical College
Curated by ChEMBL
LigandPNGBDBM50551373(CHEMBL4795995)
Affinity DataKi:  0.447nM. Assay description: Displacement of [3H]-methylspiperone from recombinant human D2 receptor expressed in CHOK1 cell membranes measured after 60 mins by microbeta countin...
Ligand InfoPC cidPC sid
In DepthDetails ArticlePubMed
Target5-hydroxytryptamine receptor 2A(Homo sapiens (Human))
Jagiellonian University Medical College
Curated by ChEMBL
LigandPNGBDBM50551373(CHEMBL4795995)
Affinity DataKi:  3.20nM. Assay description: Displacement of [3H]-ketanserin from recombinant human 5HT2A receptor expressed in CHOK1 cell membranes measured after 1 hr by microbeta counting met...
Ligand InfoPC cidPC sid
In DepthDetails ArticlePubMed
Target5-hydroxytryptamine receptor 6(Homo sapiens (Human))
Jagiellonian University Medical College
Curated by ChEMBL
LigandPNGBDBM50551373(CHEMBL4795995)
Affinity DataKi:  3.20nM. Assay description: Displacement of [3H]-LSD from recombinant human 5HT6 receptor expressed in CHOK1 cell membranes measured after 1 hr by microbeta counting method
Ligand InfoPC cidPC sid
In DepthDetails ArticlePubMed
Target5-hydroxytryptamine receptor 7(Homo sapiens (Human))
Jagiellonian University Medical College
Curated by ChEMBL
LigandPNGBDBM50551373(CHEMBL4795995)
Affinity DataKi:  4.80nM. Assay description: Displacement of [3H]-LSD from recombinant human 5HT7 receptor expressed in CHOK1 cell membranes measured after 120 mins by microbeta counting method
Ligand InfoPC cidPC sid
In DepthDetails ArticlePubMed