BDBM50551378 CHEMBL4785434
SMILES Cn1ccc2cc(ccc12)S(=O)(=O)N[C@H]1CCN(CCCc2noc3ccccc23)C1
InChI Key InChIKey=MIDQPNSXCMMZSS-SFHVURJKSA-N
Data  4 KI
  Tab Delimited (TSV)   2D SDfile   Computed 3D by Vconf -m prep SDfile
Find this compound or compounds like it in BindingDB:
Activity Spreadsheet -- Enzyme Inhibition Constant Data from BindingDB
Found 4 hits for monomerid = 50551378
Target5-hydroxytryptamine receptor 2A(Homo sapiens (Human))
Jagiellonian University Medical College
Curated by ChEMBL
LigandPNGBDBM50551378(CHEMBL4785434)
Affinity DataKi:  0.447nM. Assay description: Displacement of [3H]-ketanserin from recombinant human 5HT2A receptor expressed in CHOK1 cell membranes measured after 1 hr by microbeta counting met...
Ligand InfoPC cidPC sid
In DepthDetails ArticlePubMed
TargetD(2) dopamine receptor(Homo sapiens (Human))
Jagiellonian University Medical College
Curated by ChEMBL
LigandPNGBDBM50551378(CHEMBL4785434)
Affinity DataKi:  12nM. Assay description: Displacement of [3H]-methylspiperone from recombinant human D2 receptor expressed in CHOK1 cell membranes measured after 60 mins by microbeta countin...
Ligand InfoPC cidPC sid
In DepthDetails ArticlePubMed
Target5-hydroxytryptamine receptor 6(Homo sapiens (Human))
Jagiellonian University Medical College
Curated by ChEMBL
LigandPNGBDBM50551378(CHEMBL4785434)
Affinity DataKi:  22nM. Assay description: Displacement of [3H]-LSD from recombinant human 5HT6 receptor expressed in CHOK1 cell membranes measured after 1 hr by microbeta counting method
Ligand InfoPC cidPC sid
In DepthDetails ArticlePubMed
Target5-hydroxytryptamine receptor 7(Homo sapiens (Human))
Jagiellonian University Medical College
Curated by ChEMBL
LigandPNGBDBM50551378(CHEMBL4785434)
Affinity DataKi:  38nM. Assay description: Displacement of [3H]-LSD from recombinant human 5HT7 receptor expressed in CHOK1 cell membranes measured after 120 mins by microbeta counting method
Ligand InfoPC cidPC sid
In DepthDetails ArticlePubMed