BDBM50552368 CHEMBL4787001
SMILES C[C@@H](Nc1c(Cl)cnc2ccc(cc12)-c1cnc(nc1)C(C)(C)O)c1ccccc1F
InChI Key InChIKey=TZXWJHVVESOPPE-CQSZACIVSA-N
Data  2 IC50
PDB links: 1 PDB ID matches this monomer.
  Tab Delimited (TSV)   2D SDfile   Computed 3D by Vconf -m prep SDfile
Find this compound or compounds like it in BindingDB:
Activity Spreadsheet -- Enzyme Inhibition Constant Data from BindingDB
Found 2 hits for monomerid = 50552368
TargetTumor necrosis factor(Homo sapiens (Human))
Bristol Myers Squibb
Curated by ChEMBL
LigandPNGBDBM50552368(CHEMBL4787001)
Affinity DataIC50:  110nM. Assay description: Inhibition of exogenous human TNFalpha in HEK-Blue-CD40L cells assessed as reduction in TNF-alpha-induced NFkappaB activation incubated for 18 hrs by...
Ligand InfoPC cidPC sidPDB
TargetTumor necrosis factor(Homo sapiens (Human))
Bristol Myers Squibb
Curated by ChEMBL
LigandPNGBDBM50552368(CHEMBL4787001)
Affinity DataIC50:  17nM. Assay description: Displacement of fluorescent labeled probe from human recombinant His-tagged TNFalpha (77 to 233 residues) expressed in Escherichia coli preincubated ...
Ligand InfoPC cidPC sidPDB