BDBM50553198 CHEMBL4796754
SMILES CN(C)C(=O)Cc1ccc(Nc2nc(C#C)c3nc[nH]c3n2)cc1
InChI Key InChIKey=NJYWEFCVBJNUOV-UHFFFAOYSA-N
Data  1 IC50
  Tab Delimited (TSV)   2D SDfile   Computed 3D by Vconf -m prep SDfile
Find this compound or compounds like it in BindingDB:
Activity Spreadsheet -- Enzyme Inhibition Constant Data from BindingDB
Found 1 hit for monomerid = 50553198
TargetSerine/threonine-protein kinase Nek2(Homo sapiens (Human))
Newcastle University
Curated by ChEMBL
LigandPNGBDBM50553198(CHEMBL4796754)
Affinity DataIC50:  57nM. Assay description: Inhibition of human recombinant full length His-tagged NEK2 expressed in baculovirus expression system assessed as inhibition of substrate phosphoryl...
Ligand InfoPC cidPC sid
In DepthDetails ArticlePubMed