BDBM50555368 CHEMBL4794107
SMILES Cc1cc(NC2Cc3cc(F)c(F)cc3C2)n2nc(nc2n1)C(C)(F)F
InChI Key InChIKey=SITNTKTWRALOFE-UHFFFAOYSA-N
Data  10 IC50
  Tab Delimited (TSV)   2D SDfile   Computed 3D by Vconf -m prep SDfile
Find this compound or compounds like it in BindingDB:
Activity Spreadsheet -- Enzyme Inhibition Constant Data from BindingDB
Found 10 hits for monomerid = 50555368
TargetDihydroorotate dehydrogenase (quinone), mitochondrial(Mus musculus)
University Of Washington
Curated by ChEMBL
LigandPNGBDBM50555368(CHEMBL4794107)
Affinity DataIC50: >1.00E+5nM. Assay description: Inhibition of N-terminal His6-tagged mouse DHODH expressed in Escherichia coli BL21 using L-DHO as substrate and CoQ as co-substrate by DCIP dye base...
Ligand InfoPC cidPC sid
In DepthDetails ArticlePubMed
TargetPotassium voltage-gated channel subfamily H member 2(Homo sapiens (Human))
University Of Washington
Curated by ChEMBL
LigandPNGBDBM50555368(CHEMBL4794107)
Affinity DataIC50:  1.70E+3nM. Assay description: Inhibition of human ERG by patch clamp electrophysiology assay
Ligand InfoPC cidPC sid
In DepthDetails ArticlePubMed
TargetCytochrome P450 1A2(Homo sapiens (Human))
University Of Washington
Curated by ChEMBL
LigandPNGBDBM50555368(CHEMBL4794107)
Affinity DataIC50: >2.00E+4nM. Assay description: Inhibition of CYP1A2 in human liver microsomes using isoform-specific probe substrate in presence of NADPH-generating system by LC-MS analysis
Ligand InfoPC cidPC sid
In DepthDetails ArticlePubMed
TargetCytochrome P450 2B6(Homo sapiens (Human))
University Of Washington
Curated by ChEMBL
LigandPNGBDBM50555368(CHEMBL4794107)
Affinity DataIC50: >2.00E+4nM. Assay description: Inhibition of CYP2B6 in human liver microsomes using isoform-specific probe substrates in presence of NADPH-generating system by LC-MS analysis
Ligand InfoPC cidPC sid
In DepthDetails ArticlePubMed
TargetDihydroorotate dehydrogenase (quinone), mitochondrial(Rattus norvegicus (rat))
University Of Washington
Curated by ChEMBL
LigandPNGBDBM50555368(CHEMBL4794107)
Affinity DataIC50: >1.00E+5nM. Assay description: Inhibition of N-terminal His6-tagged rat DHODH expressed in Escherichia coli BL21 expressed in Escherichia coli BL21 using L-DHO as substrate and CoQ...
Ligand InfoPC cidPC sid
In DepthDetails ArticlePubMed
TargetCytochrome P450 3A4(Homo sapiens (Human))
University Of Washington
Curated by ChEMBL
LigandPNGBDBM50555368(CHEMBL4794107)
Affinity DataIC50: >2.00E+4nM. Assay description: Inhibition of CYP3A4 in human liver microsomes using isoform-specific probe substrates in presence of NADPH-generating system by LC-MS analysis
Ligand InfoPC cidPC sid
In DepthDetails ArticlePubMed
TargetCytochrome P450 2C19(Homo sapiens (Human))
University Of Washington
Curated by ChEMBL
LigandPNGBDBM50555368(CHEMBL4794107)
Affinity DataIC50: >2.00E+4nM. Assay description: Inhibition of CYP2C19 in human liver microsomes using isoform-specific probe substrates in presence of NADPH-generating system by LC-MS analysis
Ligand InfoPC cidPC sid
In DepthDetails ArticlePubMed
TargetCytochrome P450 2C9(Homo sapiens (Human))
University Of Washington
Curated by ChEMBL
LigandPNGBDBM50555368(CHEMBL4794107)
Affinity DataIC50:  1.85E+4nM. Assay description: Inhibition of CYP2C9 in human liver microsomes using isoform-specific probe substrates in presence of NADPH-generating system by LC-MS analysis
Ligand InfoPC cidPC sid
In DepthDetails ArticlePubMed
TargetDihydroorotate dehydrogenase (quinone), mitochondrial(Homo sapiens (Human))
University Of Washington
Curated by ChEMBL
LigandPNGBDBM50555368(CHEMBL4794107)
Affinity DataIC50: >1.00E+5nM. Assay description: Inhibition of N-terminal His6-tagged human DHODH expressed in Escherichia coli BL21 using L-DHO as substrate and CoQ as co-substrate by DCIP dye base...
Ligand InfoPC cidPC sid
In DepthDetails ArticlePubMed
TargetCytochrome P450 2D6(Homo sapiens (Human))
University Of Washington
Curated by ChEMBL
LigandPNGBDBM50555368(CHEMBL4794107)
Affinity DataIC50:  5.90E+3nM. Assay description: Inhibition of CYP2D6 in human liver microsomes using isoform-specific probe substrates in presence of NADPH-generating system by LC-MS analysis
Ligand InfoPC cidPC sid
In DepthDetails ArticlePubMed