BDBM50556151 CHEMBL4791706
SMILES COc1ccc(cc1)-c1ccc(cc1)-c1coc(C)n1
InChI Key InChIKey=QEYNFQKPJRVRRZ-UHFFFAOYSA-N
Data  1 IC50
  Tab Delimited (TSV)   2D SDfile   Computed 3D by Vconf -m prep SDfile
Find this compound or compounds like it in BindingDB:
Activity Spreadsheet -- Enzyme Inhibition Constant Data from BindingDB
Found 1 hit for monomerid = 50556151
TargetEctonucleotide pyrophosphatase/phosphodiesterase family member 3(Homo sapiens (Human))
Quaid-I-Azam University
Curated by ChEMBL
LigandPNGBDBM50556151(CHEMBL4791706)
Affinity DataIC50:  170nM. Assay description: Inhibition of human recombinant NPP3 expressed in COS-7 cell membrane at 100 uM using p-nitrophenyl thymidine monophosphate substrate incubated for 3...
Ligand InfoPC cidPC sid
In DepthDetails ArticlePubMed