BDBM50556828 CHEMBL4798771
SMILES CCCCCCCCCCCCCCCC(=O)N[C@@H](CCC(=O)NCCCC[C@H](NC(=O)CCC(=O)N[C@@H](CS)C(=O)N[C@@H](CCSC)C(=O)N1CCC[C@H]1C(=O)N[C@@H](CC(C)C)C(=O)N[C@@H](Cc1c[nH]cn1)C(=O)N[C@@H](CO)C(=O)N[C@@H](CCCNC(N)=N)C(=O)N[C@@H](C(C)C)C(=O)N1CCC[C@H]1C(=O)N[C@@H](Cc1ccccc1)C(=O)N1CCC[C@H]1C(N)=O)C(=O)N[C@@H](CS)C(=O)N[C@@H](CCSC)C(=O)N1CCC[C@H]1C(=O)N[C@@H](CC(C)C)C(=O)N[C@@H](Cc1c[nH]cn1)C(=O)N[C@@H](CO)C(=O)N[C@@H](CCCNC(N)=N)C(=O)N[C@@H](C(C)C)C(=O)N1CCC[C@H]1C(=O)N[C@@H](Cc1ccccc1)C(=O)N1CCC[C@H]1C(N)=O)C(O)=O
InChI Key InChIKey=NSQLWUYUJHSYCC-OAJYDDDBSA-N
Data  1 KI  1 EC50
  Tab Delimited (TSV)   2D SDfile   Computed 3D by Vconf -m prep SDfile
Find this compound or compounds like it in BindingDB:
Activity Spreadsheet -- Enzyme Inhibition Constant Data from BindingDB
Found 2 hits for monomerid = 50556828
TargetApelin receptor(Homo sapiens (Human))
Huazhong University Of Science & Technology
Curated by ChEMBL
LigandPNGBDBM50556828(CHEMBL4798771)
Affinity DataKi:  0.600nM. Assay description: Displacement of [Glp65, Nle75, Tyr77][125I]-apelin13 from human APJ receptor expressed in HEK293 cells incubated for 1 hr by gamma counting based rad...
Ligand InfoKEGGPC cidPC sid
In DepthDetails ArticlePubMed
TargetApelin receptor(Rattus norvegicus)
Huazhong University Of Science & Technology
Curated by ChEMBL
LigandPNGBDBM50556828(CHEMBL4798771)
Affinity DataEC50:  9.5nM. Assay description: Agonist activity at APJ receptor in rat NRK-52E cells assessed as effect on cAMP accumulation incubated for 1 hr by cAMP-Glo assay
Ligand InfoKEGGPC cidPC sid
In DepthDetails ArticlePubMed