BDBM50558941 CHEMBL4779734
SMILES NS(=O)(=O)c1ccc(cc1)N1C(=O)CC(C2CCCCCC2=O)C1=O
InChI Key InChIKey=WGSLQLRGHUDUEC-UHFFFAOYSA-N
Data  3 IC50
  Tab Delimited (TSV)   2D SDfile   Computed 3D by Vconf -m prep SDfile
Find this compound or compounds like it in BindingDB:
Activity Spreadsheet -- Enzyme Inhibition Constant Data from BindingDB
Found 3 hits for monomerid = 50558941
TargetProstaglandin G/H synthase 1(Ovis aries (Sheep))
University Of Malakand
Curated by ChEMBL
LigandPNGBDBM50558941(CHEMBL4779734)
Affinity DataIC50:  4.91E+4nM. Assay description: Inhibition of sheep COX1 using arachidonic acid as substrate preincubated for 5 mins followed by substrate addition and measured after 5 mins by UV-v...
Ligand InfoPC cidPC sid
In DepthDetails ArticlePubMed
TargetPolyunsaturated fatty acid 5-lipoxygenase(Homo sapiens (Human))
University Of Malakand
Curated by ChEMBL
LigandPNGBDBM50558941(CHEMBL4779734)
Affinity DataIC50:  1.62E+4nM. Assay description: Inhibition of recombinant human 5LOX expressed in baculovirus infected Sf insect cells using linoleic acid as substrate preincubated for 5 mins follo...
Ligand InfoPC cidPC sid
In DepthDetails ArticlePubMed
TargetCytochrome c oxidase subunit 2(Homo sapiens (Human))
University Of Malakand
Curated by ChEMBL
LigandPNGBDBM50558941(CHEMBL4779734)
Affinity DataIC50:  2.07E+4nM. Assay description: Inhibition of recombinant human COX2 expressed in baculovirus infected Sf21 cells using arachidonic acid as substrate preincubated for 5 mins followe...
Ligand InfoPC cidPC sid
In DepthDetails ArticlePubMed