BDBM50558944 CHEMBL4764720
SMILES O=C1CC(C2CCCCCC2=O)C(=O)N1c1ccccc1
InChI Key InChIKey=HUWDGPQFKCZZFH-UHFFFAOYSA-N
Data  3 IC50
  Tab Delimited (TSV)   2D SDfile   Computed 3D by Vconf -m prep SDfile
Find this compound or compounds like it in BindingDB:
Activity Spreadsheet -- Enzyme Inhibition Constant Data from BindingDB
Found 3 hits for monomerid = 50558944
TargetProstaglandin G/H synthase 1(Ovis aries (Sheep))
University Of Malakand
Curated by ChEMBL
LigandPNGBDBM50558944(CHEMBL4764720)
Affinity DataIC50:  6.56E+4nM. Assay description: Inhibition of sheep COX1 using arachidonic acid as substrate preincubated for 5 mins followed by substrate addition and measured after 5 mins by UV-v...
Ligand InfoPC cidPC sid
In DepthDetails ArticlePubMed
TargetPolyunsaturated fatty acid 5-lipoxygenase(Homo sapiens (Human))
University Of Malakand
Curated by ChEMBL
LigandPNGBDBM50558944(CHEMBL4764720)
Affinity DataIC50:  1.84E+4nM. Assay description: Inhibition of recombinant human 5LOX expressed in baculovirus infected Sf insect cells using linoleic acid as substrate preincubated for 5 mins follo...
Ligand InfoPC cidPC sid
In DepthDetails ArticlePubMed
TargetCytochrome c oxidase subunit 2(Homo sapiens (Human))
University Of Malakand
Curated by ChEMBL
LigandPNGBDBM50558944(CHEMBL4764720)
Affinity DataIC50:  3.95E+4nM. Assay description: Inhibition of recombinant human COX2 expressed in baculovirus infected Sf21 cells using arachidonic acid as substrate preincubated for 5 mins followe...
Ligand InfoPC cidPC sid
In DepthDetails ArticlePubMed