BDBM50562138 CHEMBL4758717
SMILES CC(C)c1ccc(cc1)C(=O)C1CCN(CC1)C(=O)c1cc(O)c(F)cc1F
InChI Key InChIKey=FZBKWZIDLKEHTE-UHFFFAOYSA-N
Data  1 IC50
  Tab Delimited (TSV)   2D SDfile   Computed 3D by Vconf -m prep SDfile
Find this compound or compounds like it in BindingDB:
Activity Spreadsheet -- Enzyme Inhibition Constant Data from BindingDB
Found 1 hit for monomerid = 50562138
TargetMonoglyceride lipase(Homo sapiens (Human))
University Of Pisa
Curated by ChEMBL
LigandPNGBDBM50562138(CHEMBL4758717)
Affinity DataIC50:  31nM. Assay description: Inhibition of human recombinant MAGL using 4-nitrophenylacetate as substrate incubated for 30 mins by microplate reader assay
Ligand InfoPC cidPC sid
In DepthDetails ArticlePubMed