BDBM50564899 CHEMBL4786489
SMILES Cc1c(nnn1-c1ccc(Cl)cc1)-c1nn(cc1\C=N\O)-c1ccccc1
InChI Key InChIKey=VOTFSAMNGHICLF-SRZZPIQSSA-N
Data  4 KI  2 IC50
  Tab Delimited (TSV)   2D SDfile   Computed 3D by Vconf -m prep SDfile
Find this compound or compounds like it in BindingDB:
Activity Spreadsheet -- Enzyme Inhibition Constant Data from BindingDB
Found 6 hits for monomerid = 50564899
TargetCarbonic anhydrase 1(Homo sapiens (Human))
Alexandria University
Curated by ChEMBL
LigandPNGBDBM50564899(CHEMBL4786489)
Affinity DataKi: >1.00E+5nM. Assay description: Inhibition of human CA1 by stopped-flow carbon dioxide hydration assay
Ligand InfoKEGGPC cidPC sid
In DepthDetails ArticlePubMed
TargetCarbonic anhydrase 9(Homo sapiens (Human))
Alexandria University
Curated by ChEMBL
LigandPNGBDBM50564899(CHEMBL4786489)
Affinity DataKi: >1.00E+5nM. Assay description: Inhibition of human CA9 by stopped-flow carbon dioxide hydration assay
Ligand InfoKEGGPC cidPC sid
In DepthDetails ArticlePubMed
TargetCarbonic anhydrase 12(Homo sapiens (Human))
Alexandria University
Curated by ChEMBL
LigandPNGBDBM50564899(CHEMBL4786489)
Affinity DataKi: >1.00E+5nM. Assay description: Inhibition of human CA12 by stopped-flow carbon dioxide hydration assay
Ligand InfoKEGGPC cidPC sid
In DepthDetails ArticlePubMed
TargetCarbonic anhydrase 2(Homo sapiens (Human))
Alexandria University
Curated by ChEMBL
LigandPNGBDBM50564899(CHEMBL4786489)
Affinity DataKi: >1.00E+5nM. Assay description: Inhibition of human CA2 by stopped-flow carbon dioxide hydration assay
Ligand InfoKEGGPC cidPC sid
In DepthDetails ArticlePubMed
TargetProstaglandin G/H synthase 2(Homo sapiens (Human))
Alexandria University
Curated by ChEMBL
LigandPNGBDBM50564899(CHEMBL4786489)
Affinity DataIC50:  50nM. Assay description: Inhibition of human recombinant COX2 by colorimetric analysis
Ligand InfoKEGGPC cidPC sid
In DepthDetails ArticlePubMed
TargetProstaglandin G/H synthase 1(Ovis aries (Sheep))
Alexandria University
Curated by ChEMBL
LigandPNGBDBM50564899(CHEMBL4786489)
Affinity DataIC50:  1.29E+4nM. Assay description: Inhibition of ovine COX1 by colorimetric analysis
Ligand InfoKEGGPC cidPC sid
In DepthDetails ArticlePubMed