BDBM50564915 CHEMBL4790291
SMILES C\C(=N/NC(N)=S)c1nnn(c1C)-c1ccc(F)cc1
InChI Key InChIKey=BEPDFRPSNCPHCP-VIZOYTHASA-N
Data  4 KI  2 IC50
  Tab Delimited (TSV)   2D SDfile   Computed 3D by Vconf -m prep SDfile
Find this compound or compounds like it in BindingDB:
Activity Spreadsheet -- Enzyme Inhibition Constant Data from BindingDB
Found 6 hits for monomerid = 50564915
TargetCarbonic anhydrase 1(Homo sapiens (Human))
Alexandria University
Curated by ChEMBL
LigandPNGBDBM50564915(CHEMBL4790291)
Affinity DataKi: >1.00E+5nM. Assay description: Inhibition of human CA1 by stopped-flow carbon dioxide hydration assay
Ligand InfoPC cidPC sid
In DepthDetails ArticlePubMed
TargetCarbonic anhydrase 9(Homo sapiens (Human))
Alexandria University
Curated by ChEMBL
LigandPNGBDBM50564915(CHEMBL4790291)
Affinity DataKi: >1.00E+5nM. Assay description: Inhibition of human CA9 by stopped-flow carbon dioxide hydration assay
Ligand InfoPC cidPC sid
In DepthDetails ArticlePubMed
TargetCarbonic anhydrase 12(Homo sapiens (Human))
Alexandria University
Curated by ChEMBL
LigandPNGBDBM50564915(CHEMBL4790291)
Affinity DataKi: >1.00E+5nM. Assay description: Inhibition of human CA12 by stopped-flow carbon dioxide hydration assay
Ligand InfoPC cidPC sid
In DepthDetails ArticlePubMed
TargetCarbonic anhydrase 2(Homo sapiens (Human))
Alexandria University
Curated by ChEMBL
LigandPNGBDBM50564915(CHEMBL4790291)
Affinity DataKi: >1.00E+5nM. Assay description: Inhibition of human CA2 by stopped-flow carbon dioxide hydration assay
Ligand InfoPC cidPC sid
In DepthDetails ArticlePubMed
TargetProstaglandin G/H synthase 2(Homo sapiens (Human))
Alexandria University
Curated by ChEMBL
LigandPNGBDBM50564915(CHEMBL4790291)
Affinity DataIC50:  70nM. Assay description: Inhibition of human recombinant COX2 by colorimetric analysis
Ligand InfoPC cidPC sid
In DepthDetails ArticlePubMed
TargetProstaglandin G/H synthase 1(Ovis aries (Sheep))
Alexandria University
Curated by ChEMBL
LigandPNGBDBM50564915(CHEMBL4790291)
Affinity DataIC50:  9.60E+3nM. Assay description: Inhibition of ovine COX1 by colorimetric analysis
Ligand InfoPC cidPC sid
In DepthDetails ArticlePubMed