BDBM50568640 CHEMBL4874877
SMILES [H][C@@]12C[C@@]3([H])C(CN1CC[C@@]1(C2=Nc2ccccc12)[C@]3(COC(C)=O)C(=O)OC)=CC
InChI Key InChIKey=QBHALCZZZWCCLV-XIPRXZKPSA-N
Data  7 KI  6 IC50
  Tab Delimited (TSV)   2D SDfile   Computed 3D by Vconf -m prep SDfile
Find this compound or compounds like it in BindingDB:
Activity Spreadsheet -- Enzyme Inhibition Constant Data from BindingDB
Found 13 hits for monomerid = 50568640
TargetKappa-type opioid receptor(Homo sapiens (Human))
University Of Illinois At Chicago
Curated by ChEMBL
LigandPNGBDBM50568640(CHEMBL4874877)
Affinity DataKi:  1.11E+3nM. Assay description: Displacement of [3H]-U69593 from human kappa opioid receptor expressed in U2OS cells by radioligand binding assay
Ligand InfoPC cidPC sid
In DepthDetails ArticlePubMed
TargetKappa-type opioid receptor(Homo sapiens (Human))
University Of Illinois At Chicago
Curated by ChEMBL
LigandPNGBDBM50568640(CHEMBL4874877)
Affinity DataKi:  1.11E+3nM. Assay description: Displacement of [3H]-U69593 from human kappa opioid receptor expressed in U2OS cells by radioligand binding assay
Ligand InfoPC cidPC sid
In DepthDetails ArticlePubMed
TargetD(1B) dopamine receptor(Homo sapiens (Human))
University Of Illinois At Chicago
Curated by ChEMBL
LigandPNGBDBM50568640(CHEMBL4874877)
Affinity DataKi: >1.00E+4nM. Assay description: Displacement of [3H]-SCH23390 from dopamine D5 receptor (unknown origin) expressed in HEK-293T cells assessed as inhibition constant
Ligand InfoPC cidPC sid
In DepthDetails ArticlePubMed
TargetMu-type opioid receptor(Homo sapiens (Human))
University Of Illinois At Chicago
Curated by ChEMBL
LigandPNGBDBM50568640(CHEMBL4874877)
Affinity DataKi:  3.07E+4nM. Assay description: Displacement of [3H]-DAMGO from human mu opioid receptor expressed in CHO-K1 cells by radioligand binding assay
Ligand InfoPC cidPC sid
In DepthDetails ArticlePubMed
TargetMu-type opioid receptor(Homo sapiens (Human))
University Of Illinois At Chicago
Curated by ChEMBL
LigandPNGBDBM50568640(CHEMBL4874877)
Affinity DataKi:  3.16E+4nM. Assay description: Displacement of [3H]-DAMGO from human mu opioid receptor expressed in CHO-K1 cells by radioligand binding assay
Ligand InfoPC cidPC sid
In DepthDetails ArticlePubMed
TargetDelta-type opioid receptor(Homo sapiens (Human))
University Of Illinois At Chicago
Curated by ChEMBL
LigandPNGBDBM50568640(CHEMBL4874877)
Affinity DataKi:  6.03E+4nM. Assay description: Displacement of [3H]-DPDPE from human delta opioid receptor expressed in CHO-K1 cells by radioligand binding assay
Ligand InfoPC cidPC sid
In DepthDetails ArticlePubMed
TargetDelta-type opioid receptor(Homo sapiens (Human))
University Of Illinois At Chicago
Curated by ChEMBL
LigandPNGBDBM50568640(CHEMBL4874877)
Affinity DataKi:  6.31E+4nM. Assay description: Displacement of [3H]-DPDPE from human delta opioid receptor expressed in CHO-K1 cells by radioligand binding assay
Ligand InfoPC cidPC sid
In DepthDetails ArticlePubMed
TargetMu-type opioid receptor(MOUSE)
University Of Illinois At Chicago
Curated by ChEMBL
LigandPNGBDBM50568640(CHEMBL4874877)
Affinity DataIC50:  1.87E+4nM. Assay description: Agonist activity at mouse HA-tagged mu opioid receptor expressed in HEK293 cells assessed as inhibition of forskolin-induced cAMP production preincub...
Ligand InfoPC cidPC sid
In DepthDetails ArticlePubMed
TargetMu-type opioid receptor(MOUSE)
University Of Illinois At Chicago
Curated by ChEMBL
LigandPNGBDBM50568640(CHEMBL4874877)
Affinity DataIC50:  2.00E+4nM. Assay description: Agonist activity at mouse HA-tagged mu opioid receptor expressed in HEK293 cells assessed as inhibition of forskolin-induced cAMP production preincub...
Ligand InfoPC cidPC sid
In DepthDetails ArticlePubMed
TargetKappa-type opioid receptor(Mus musculus (Mouse))
University Of Illinois At Chicago
Curated by ChEMBL
LigandPNGBDBM50568640(CHEMBL4874877)
Affinity DataIC50:  2.71E+3nM. Assay description: Agonist activity at mouse FLAG-tagged kappa opioid receptor expressed in HEK293 cells assessed as inhibition of forskolin-induced cAMP production pre...
Ligand InfoPC cidPC sid
In DepthDetails ArticlePubMed
TargetKappa-type opioid receptor(Mus musculus (Mouse))
University Of Illinois At Chicago
Curated by ChEMBL
LigandPNGBDBM50568640(CHEMBL4874877)
Affinity DataIC50:  2.51E+3nM. Assay description: Agonist activity at mouse FLAG-tagged kappa opioid receptor expressed in HEK293 cells assessed as inhibition of forskolin-induced cAMP production pre...
Ligand InfoPC cidPC sid
In DepthDetails ArticlePubMed
TargetDelta-type opioid receptor(MOUSE)
University Of Illinois At Chicago
Curated by ChEMBL
LigandPNGBDBM50568640(CHEMBL4874877)
Affinity DataIC50:  2.44E+4nM. Assay description: Agonist activity at mouse FLAG-tagged delta opioid receptor expressed in HEK293 cells assessed as inhibition of forskolin-induced cAMP production pre...
Ligand InfoPC cidPC sid
In DepthDetails ArticlePubMed
TargetDelta-type opioid receptor(MOUSE)
University Of Illinois At Chicago
Curated by ChEMBL
LigandPNGBDBM50568640(CHEMBL4874877)
Affinity DataIC50:  2.51E+4nM. Assay description: Agonist activity at mouse FLAG-tagged delta opioid receptor expressed in HEK293 cells assessed as inhibition of forskolin-induced cAMP production pre...
Ligand InfoPC cidPC sid
In DepthDetails ArticlePubMed