BDBM50568642 CHEMBL4856018
SMILES [H][C@@]12C[C@@]3([H])C(CN1[C@@]([H])(Cc1c2[nH]c2ccccc12)[C@@]3(CO)C(=O)OC)=CC
InChI Key InChIKey=RCEFXZXHYFOPIE-GJZACXSBSA-N
Data  6 KI  4 IC50
  Tab Delimited (TSV)   2D SDfile   Computed 3D by Vconf -m prep SDfile
Find this compound or compounds like it in BindingDB:
Activity Spreadsheet -- Enzyme Inhibition Constant Data from BindingDB
Found 10 hits for monomerid = 50568642
TargetMu-type opioid receptor(Homo sapiens (Human))
University Of Illinois At Chicago
Curated by ChEMBL
LigandPNGBDBM50568642(CHEMBL4856018)
Affinity DataKi:  316nM. Assay description: Displacement of [3H]-DAMGO from human mu opioid receptor expressed in CHO-K1 cells by radioligand binding assay
Ligand InfoPC cidPC sid
In DepthDetails ArticlePubMed
TargetMu-type opioid receptor(Homo sapiens (Human))
University Of Illinois At Chicago
Curated by ChEMBL
LigandPNGBDBM50568642(CHEMBL4856018)
Affinity DataKi:  320nM. Assay description: Displacement of [3H]-DAMGO from human mu opioid receptor expressed in CHO-K1 cells by radioligand binding assay
Ligand InfoPC cidPC sid
In DepthDetails ArticlePubMed
TargetKappa-type opioid receptor(Homo sapiens (Human))
University Of Illinois At Chicago
Curated by ChEMBL
LigandPNGBDBM50568642(CHEMBL4856018)
Affinity DataKi:  1.42E+4nM. Assay description: Displacement of [3H]-U69593 from human kappa opioid receptor expressed in U2OS cells by radioligand binding assay
Ligand InfoPC cidPC sid
In DepthDetails ArticlePubMed
TargetKappa-type opioid receptor(Homo sapiens (Human))
University Of Illinois At Chicago
Curated by ChEMBL
LigandPNGBDBM50568642(CHEMBL4856018)
Affinity DataKi:  1.42E+4nM. Assay description: Displacement of [3H]-U69593 from human kappa opioid receptor expressed in U2OS cells by radioligand binding assay
Ligand InfoPC cidPC sid
In DepthDetails ArticlePubMed
TargetDelta-type opioid receptor(Homo sapiens (Human))
University Of Illinois At Chicago
Curated by ChEMBL
LigandPNGBDBM50568642(CHEMBL4856018)
Affinity DataKi:  1.50E+4nM. Assay description: Displacement of [3H]-DPDPE from human delta opioid receptor expressed in CHO-K1 cells by radioligand binding assay
Ligand InfoPC cidPC sid
In DepthDetails ArticlePubMed
TargetDelta-type opioid receptor(Homo sapiens (Human))
University Of Illinois At Chicago
Curated by ChEMBL
LigandPNGBDBM50568642(CHEMBL4856018)
Affinity DataKi:  1.58E+4nM. Assay description: Displacement of [3H]-DPDPE from human delta opioid receptor expressed in CHO-K1 cells by radioligand binding assay
Ligand InfoPC cidPC sid
In DepthDetails ArticlePubMed
TargetMu-type opioid receptor(MOUSE)
University Of Illinois At Chicago
Curated by ChEMBL
LigandPNGBDBM50568642(CHEMBL4856018)
Affinity DataIC50:  3.14E+3nM. Assay description: Agonist activity at mouse HA-tagged mu opioid receptor expressed in HEK293 cells assessed as inhibition of forskolin-induced cAMP production preincub...
Ligand InfoPC cidPC sid
In DepthDetails ArticlePubMed
TargetMu-type opioid receptor(MOUSE)
University Of Illinois At Chicago
Curated by ChEMBL
LigandPNGBDBM50568642(CHEMBL4856018)
Affinity DataIC50:  3.16E+3nM. Assay description: Agonist activity at mouse HA-tagged mu opioid receptor expressed in HEK293 cells assessed as inhibition of forskolin-induced cAMP production preincub...
Ligand InfoPC cidPC sid
In DepthDetails ArticlePubMed
TargetDelta-type opioid receptor(MOUSE)
University Of Illinois At Chicago
Curated by ChEMBL
LigandPNGBDBM50568642(CHEMBL4856018)
Affinity DataIC50:  1.54E+4nM. Assay description: Agonist activity at mouse FLAG-tagged delta opioid receptor expressed in HEK293 cells assessed as inhibition of forskolin-induced cAMP production pre...
Ligand InfoPC cidPC sid
In DepthDetails ArticlePubMed
TargetDelta-type opioid receptor(MOUSE)
University Of Illinois At Chicago
Curated by ChEMBL
LigandPNGBDBM50568642(CHEMBL4856018)
Affinity DataIC50:  1.58E+4nM. Assay description: Agonist activity at mouse FLAG-tagged delta opioid receptor expressed in HEK293 cells assessed as inhibition of forskolin-induced cAMP production pre...
Ligand InfoPC cidPC sid
In DepthDetails ArticlePubMed