BDBM50571063 CHEMBL4867768
SMILES CC.FC(F)(F)Oc1ccc(cc1Cl)\N=c1/ssnc1Cl
InChI Key InChIKey=MLZUYLRPWGRHEE-ZTXYIFKNSA-N
Data  1 IC50
  Tab Delimited (TSV)   2D SDfile   Computed 3D by Vconf -m prep SDfile
Find this compound or compounds like it in BindingDB:
Activity Spreadsheet -- Enzyme Inhibition Constant Data from BindingDB
Found 1 hit for monomerid = 50571063
TargetNeutral amino acid transporter B(0)(Homo sapiens (Human))
University Of North Carolina At Chapel Hill
Curated by ChEMBL
LigandPNGBDBM50571063(CHEMBL4867768)
Affinity DataIC50:  8.10E+3nM. Assay description: Inhibition of ASCT2 (unknown origin)
Ligand InfoPC cidPC sid
In DepthDetails ArticlePubMed